Reaction Details
TargetDelta-type opioid receptor
LigandBDBM50204449
Substrate/Competitorn/a
Meas. Tech.ChEMBL_438284 (CHEMBL887390)
Ki 2.8±n/a nM
Citation Peng, XKnapp, BIBidlack, JMNeumeyer, JL High-affinity carbamate analogues of morphinan at opioid receptors. Bioorg Med Chem Lett17:1508-11 (2007) 
 
Delta-type opioid receptor
Name:Delta-type opioid receptor
Type:G Protein-Coupled Receptor (GPCR)
Mol. Mass.:40382.98
Organism:Homo sapiens (Human)
Description:Competition binding assays were carried out using membrane preparations from transfected HN9.10 cells that constitutively expressed the delta opioid receptor.
Residue:372
BDBM50204449
NameBDBM50204449
Synonyms:CHEMBL427862 | MCL-449
TypeSmall organic molecule
Emp. Form.C23H32N2O2
Mol. Mass.368.5124
SMILESCCNC(=O)Oc1ccc2CC3C4CCCCC4(CCN3CC3CC3)c2c1