Reaction Details
TargetDelta-type opioid receptor
LigandBDBM50204453
Substrate/Competitorn/a
Meas. Tech.ChEMBL_438284 (CHEMBL887390)
Ki 2.7±n/a nM
Citation Peng, XKnapp, BIBidlack, JMNeumeyer, JL High-affinity carbamate analogues of morphinan at opioid receptors. Bioorg Med Chem Lett17:1508-11 (2007) 
 
Delta-type opioid receptor
Name:Delta-type opioid receptor
Type:G Protein-Coupled Receptor (GPCR)
Mol. Mass.:40382.98
Organism:Homo sapiens (Human)
Description:Competition binding assays were carried out using membrane preparations from transfected HN9.10 cells that constitutively expressed the delta opioid receptor.
Residue:372
BDBM50204453
NameBDBM50204453
Synonyms:CHEMBL263096 | MCL-444
TypeSmall organic molecule
Emp. Form.C28H34N2O2
Mol. Mass.430.5818
SMILESO=C(NCc1ccccc1)Oc1ccc2CC3C4CCCCC4(CCN3CC3CC3)c2c1