Reaction Details
TargetKappa-type opioid receptor
LigandBDBM50204453
Substrate/Competitorn/a
Meas. Tech.ChEMBL_438283 (CHEMBL887389)
Ki 0.140000±n/a nM
Citation Peng, XKnapp, BIBidlack, JMNeumeyer, JL High-affinity carbamate analogues of morphinan at opioid receptors. Bioorg Med Chem Lett17:1508-11 (2007) 
 
Kappa-type opioid receptor
Name:Kappa-type opioid receptor
Type:G Protein-Coupled Receptor (GPCR)
Mol. Mass.:42648.76
Organism:Homo sapiens (Human)
Description:P41145
Residue:380
BDBM50204453
NameBDBM50204453
Synonyms:CHEMBL263096 | MCL-444
TypeSmall organic molecule
Emp. Form.C28H34N2O2
Mol. Mass.430.5818
SMILESO=C(NCc1ccccc1)Oc1ccc2CC3C4CCCCC4(CCN3CC3CC3)c2c1