Reaction Details
TargetKappa-type opioid receptor
LigandBDBM50204455
Substrate/Competitorn/a
Meas. Tech.ChEMBL_438288 (CHEMBL887394)
EC50 9.6±n/a nM
Citation Peng, XKnapp, BIBidlack, JMNeumeyer, JL High-affinity carbamate analogues of morphinan at opioid receptors. Bioorg Med Chem Lett17:1508-11 (2007) 
 
Kappa-type opioid receptor
Name:Kappa-type opioid receptor
Type:G Protein-Coupled Receptor (GPCR)
Mol. Mass.:42648.76
Organism:Homo sapiens (Human)
Description:P41145
Residue:380
BDBM50204455
NameBDBM50204455
Synonyms:CHEMBL242046 | MCL-435
TypeSmall organic molecule
Emp. Form.C23H32N2O2
Mol. Mass.368.5124
SMILESCNC(=O)Oc1ccc2CC3C4CCCCC4(CCN3CC3CCC3)c2c1