Reaction Details
TargetMu-type opioid receptor
LigandBDBM50204449
Substrate/Competitorn/a
Meas. Tech.ChEMBL_438291 (CHEMBL887397)
IC50 10±n/a nM
Citation Peng, XKnapp, BIBidlack, JMNeumeyer, JL High-affinity carbamate analogues of morphinan at opioid receptors. Bioorg Med Chem Lett17:1508-11 (2007) 
 
Mu-type opioid receptor
Name:Mu-type opioid receptor
Type:G Protein-Coupled Receptor (GPCR)
Mol. Mass.:44789.51
Organism:Homo sapiens (Human)
Description:P35372
Residue:400
BDBM50204449
NameBDBM50204449
Synonyms:CHEMBL427862 | MCL-449
TypeSmall organic molecule
Emp. Form.C23H32N2O2
Mol. Mass.368.5124
SMILESCCNC(=O)Oc1ccc2CC3C4CCCCC4(CCN3CC3CC3)c2c1