Reaction Details
TargetMu-type opioid receptor
LigandBDBM50204451
Substrate/Competitorn/a
Meas. Tech.ChEMBL_438290 (CHEMBL887396)
EC50 0.440000±n/a nM
Citation Peng, XKnapp, BIBidlack, JMNeumeyer, JL High-affinity carbamate analogues of morphinan at opioid receptors. Bioorg Med Chem Lett17:1508-11 (2007) 
 
Mu-type opioid receptor
Name:Mu-type opioid receptor
Type:G Protein-Coupled Receptor (GPCR)
Mol. Mass.:44789.51
Organism:Homo sapiens (Human)
Description:P35372
Residue:400
BDBM50204451
NameBDBM50204451
Synonyms:CHEMBL397035 | MCL-429
TypeSmall organic molecule
Emp. Form.C27H32N2O2
Mol. Mass.416.5552
SMILESO=C(Nc1ccccc1)Oc1ccc2CC3C4CCCCC4(CCN3CC3CC3)c2c1