Reaction Details
TargetMu-type opioid receptor
LigandBDBM50017233
Substrate/Competitorn/a
Meas. Tech.ChEMBL_438282 (CHEMBL887388)
Ki 0.210000±n/a nM
Citation Peng, XKnapp, BIBidlack, JMNeumeyer, JL High-affinity carbamate analogues of morphinan at opioid receptors. Bioorg Med Chem Lett17:1508-11 (2007) 
 
Mu-type opioid receptor
Name:Mu-type opioid receptor
Type:G Protein-Coupled Receptor (GPCR)
Mol. Mass.:44789.51
Organism:Homo sapiens (Human)
Description:P35372
Residue:400
BDBM50017233
NameBDBM50017233
Synonyms:CHEMBL592 LEVORPHANOL
TypeSmall organic molecule
Emp. Form.C17H23NO
Mol. Mass.257.3706
SMILESCN1CC[C@]23CCCC[C@H]2[C@H]1Cc1ccc(O)cc31