Reaction Details
TargetDelta-type opioid receptor
LigandBDBM50210376
Substrate/Competitorn/a
Meas. Tech.ChEMBL_438624 (CHEMBL888955)
Ki 7355±n/a nM
Citation Ho, GDBercovici, ATulshian, DGreenlee, WJFawzi, ASmith Torhan, AZhang, H Synthesis and structure-activity relationships of 4-hydroxy-4-phenylpiperidines as nociceptin receptor ligands: Part 1. Bioorg Med Chem Lett17:3023-7 (2007) 
 
Delta-type opioid receptor
Name:Delta-type opioid receptor
Type:G Protein-Coupled Receptor (GPCR)
Mol. Mass.:40382.98
Organism:Homo sapiens (Human)
Description:Competition binding assays were carried out using membrane preparations from transfected HN9.10 cells that constitutively expressed the delta opioid receptor.
Residue:372
BDBM50210376
NameBDBM50210376
Synonyms:4-phenyl-1-(phenyl(3-(trifluoromethyl)phenyl)methyl)piperidin-4-ol | CHEMBL390280
TypeSmall organic molecule
Emp. Form.C25H24F3NO
Mol. Mass.411.4594
SMILESOC1(CCN(CC1)C(c1ccccc1)c1cccc(c1)C(F)(F)F)c1ccccc1