Reaction Details
TargetDelta-type opioid receptor
LigandBDBM50210398
Substrate/Competitorn/a
Meas. Tech.ChEMBL_438624 (CHEMBL888955)
Ki 2945±n/a nM
Citation Ho, GDBercovici, ATulshian, DGreenlee, WJFawzi, ASmith Torhan, AZhang, H Synthesis and structure-activity relationships of 4-hydroxy-4-phenylpiperidines as nociceptin receptor ligands: Part 1. Bioorg Med Chem Lett17:3023-7 (2007) 
 
Delta-type opioid receptor
Name:Delta-type opioid receptor
Type:G Protein-Coupled Receptor (GPCR)
Mol. Mass.:40382.98
Organism:Homo sapiens (Human)
Description:Competition binding assays were carried out using membrane preparations from transfected HN9.10 cells that constitutively expressed the delta opioid receptor.
Residue:372
BDBM50210398
NameBDBM50210398
Synonyms:1-((2-fluorophenyl)(phenyl)methyl)-4-phenylpiperidin-4-ol | CHEMBL228802
TypeSmall organic molecule
Emp. Form.C24H24FNO
Mol. Mass.361.4519
SMILESOC1(CCN(CC1)C(c1ccccc1)c1ccccc1F)c1ccccc1