Reaction Details
TargetNociceptin receptor
LigandBDBM50210399
Substrate/Competitorn/a
Meas. Tech.ChEMBL_438633 (CHEMBL888964)
Ki 35±n/a nM
Citation Ho, GDBercovici, ATulshian, DGreenlee, WJFawzi, ASmith Torhan, AZhang, H Synthesis and structure-activity relationships of 4-hydroxy-4-phenylpiperidines as nociceptin receptor ligands: Part 1. Bioorg Med Chem Lett17:3023-7 (2007) 
 
Nociceptin receptor
Name:Nociceptin receptor
Type:G Protein-Coupled Receptor (GPCR)
Mol. Mass.:40702.87
Organism:Homo sapiens (Human)
Description:P41146
Residue:370
BDBM50210399
NameBDBM50210399
Synonyms:4-phenyl-1-(phenyl(thiophen-2-yl)methyl)piperidin-4-ol | CHEMBL228740
TypeSmall organic molecule
Emp. Form.C22H23NOS
Mol. Mass.349.489
SMILESOC1(CCN(CC1)C(c1cccs1)c1ccccc1)c1ccccc1