Reaction Details
TargetNociceptin receptor
LigandBDBM50210402
Substrate/Competitorn/a
Meas. Tech.ChEMBL_438633 (CHEMBL888964)
Ki 613±n/a nM
Citation Ho, GDBercovici, ATulshian, DGreenlee, WJFawzi, ASmith Torhan, AZhang, H Synthesis and structure-activity relationships of 4-hydroxy-4-phenylpiperidines as nociceptin receptor ligands: Part 1. Bioorg Med Chem Lett17:3023-7 (2007) 
 
Nociceptin receptor
Name:Nociceptin receptor
Type:G Protein-Coupled Receptor (GPCR)
Mol. Mass.:40702.87
Organism:Homo sapiens (Human)
Description:P41146
Residue:370
BDBM50210402
NameBDBM50210402
Synonyms:1-(3,3-diphenylpropyl)-4-phenylpiperidin-4-ol | CHEMBL230033
TypeSmall organic molecule
Emp. Form.C26H29NO
Mol. Mass.371.5146
SMILESOC1(CCN(CCC(c2ccccc2)c2ccccc2)CC1)c1ccccc1