Reaction Details
TargetNociceptin receptor
LigandBDBM50210407
Substrate/Competitorn/a
Meas. Tech.ChEMBL_438633 (CHEMBL888964)
Ki 9±n/a nM
Citation Ho, GDBercovici, ATulshian, DGreenlee, WJFawzi, ASmith Torhan, AZhang, H Synthesis and structure-activity relationships of 4-hydroxy-4-phenylpiperidines as nociceptin receptor ligands: Part 1. Bioorg Med Chem Lett17:3023-7 (2007) 
 
Nociceptin receptor
Name:Nociceptin receptor
Type:G Protein-Coupled Receptor (GPCR)
Mol. Mass.:40702.87
Organism:Homo sapiens (Human)
Description:P41146
Residue:370
BDBM50210407
NameBDBM50210407
Synonyms:1-(4-methyl-1-phenylpentyl)-4-phenylpiperidin-4-ol | CHEMBL413791
TypeSmall organic molecule
Emp. Form.C23H31NO
Mol. Mass.337.4983
SMILESCC(C)CCC(N1CCC(O)(CC1)c1ccccc1)c1ccccc1