Reaction Details
TargetKappa-type opioid receptor
LigandBDBM50210407
Substrate/Competitorn/a
Meas. Tech.ChEMBL_438623 (CHEMBL888954)
Ki 185±n/a nM
Citation Ho, GDBercovici, ATulshian, DGreenlee, WJFawzi, ASmith Torhan, AZhang, H Synthesis and structure-activity relationships of 4-hydroxy-4-phenylpiperidines as nociceptin receptor ligands: Part 1. Bioorg Med Chem Lett17:3023-7 (2007) 
 
Kappa-type opioid receptor
Name:Kappa-type opioid receptor
Type:G Protein-Coupled Receptor (GPCR)
Mol. Mass.:42648.76
Organism:Homo sapiens (Human)
Description:P41145
Residue:380
BDBM50210407
NameBDBM50210407
Synonyms:1-(4-methyl-1-phenylpentyl)-4-phenylpiperidin-4-ol | CHEMBL413791
TypeSmall organic molecule
Emp. Form.C23H31NO
Mol. Mass.337.4983
SMILESCC(C)CCC(N1CCC(O)(CC1)c1ccccc1)c1ccccc1