Reaction Details
TargetNociceptin receptor
LigandBDBM50210416
Substrate/Competitorn/a
Meas. Tech.ChEMBL_438633 (CHEMBL888964)
Ki 8183±n/a nM
Citation Ho, GDBercovici, ATulshian, DGreenlee, WJFawzi, ASmith Torhan, AZhang, H Synthesis and structure-activity relationships of 4-hydroxy-4-phenylpiperidines as nociceptin receptor ligands: Part 1. Bioorg Med Chem Lett17:3023-7 (2007) 
 
Nociceptin receptor
Name:Nociceptin receptor
Type:G Protein-Coupled Receptor (GPCR)
Mol. Mass.:40702.87
Organism:Homo sapiens (Human)
Description:P41146
Residue:370
BDBM50210416
NameBDBM50210416
Synonyms:CHEMBL228738 | N-(2,6-difluorophenyl)-2-(4-hydroxy-4-phenylpiperidin-1-yl)-2-phenylacetamide
TypeSmall organic molecule
Emp. Form.C25H24F2N2O2
Mol. Mass.422.4671
SMILESOC1(CCN(CC1)C(C(=O)Nc1c(F)cccc1F)c1ccccc1)c1ccccc1