Reaction Details
TargetNociceptin receptor
LigandBDBM50210413
Substrate/Competitorn/a
Meas. Tech.ChEMBL_438633 (CHEMBL888964)
Ki 225±n/a nM
Citation Ho, GDBercovici, ATulshian, DGreenlee, WJFawzi, ASmith Torhan, AZhang, H Synthesis and structure-activity relationships of 4-hydroxy-4-phenylpiperidines as nociceptin receptor ligands: Part 1. Bioorg Med Chem Lett17:3023-7 (2007) 
 
Nociceptin receptor
Name:Nociceptin receptor
Type:G Protein-Coupled Receptor (GPCR)
Mol. Mass.:40702.87
Organism:Homo sapiens (Human)
Description:P41146
Residue:370
BDBM50210413
NameBDBM50210413
Synonyms:4-phenyl-1-(phenyl(4-(trifluoromethyl)phenyl)methyl)piperidin-4-ol | CHEMBL228795
TypeSmall organic molecule
Emp. Form.C25H24F3NO
Mol. Mass.411.4594
SMILESOC1(CCN(CC1)C(c1ccccc1)c1ccc(cc1)C(F)(F)F)c1ccccc1