Reaction Details
TargetKappa-type opioid receptor
LigandBDBM50210386
Substrate/Competitorn/a
Meas. Tech.ChEMBL_438623 (CHEMBL888954)
Ki 312±n/a nM
Citation Ho, GDBercovici, ATulshian, DGreenlee, WJFawzi, ASmith Torhan, AZhang, H Synthesis and structure-activity relationships of 4-hydroxy-4-phenylpiperidines as nociceptin receptor ligands: Part 1. Bioorg Med Chem Lett17:3023-7 (2007) 
 
Kappa-type opioid receptor
Name:Kappa-type opioid receptor
Type:G Protein-Coupled Receptor (GPCR)
Mol. Mass.:42648.76
Organism:Homo sapiens (Human)
Description:P41145
Residue:380
BDBM50210386
NameBDBM50210386
Synonyms:1-(cyclopentyl(phenyl)methyl)-4-phenylpiperidin-4-ol | CHEMBL231608
TypeSmall organic molecule
Emp. Form.C23H29NO
Mol. Mass.335.4825
SMILESOC1(CCN(CC1)C(C1CCCC1)c1ccccc1)c1ccccc1