Reaction Details
TargetMu-type opioid receptor
LigandBDBM50210396
Substrate/Competitorn/a
Meas. Tech.ChEMBL_438625 (CHEMBL888956)
Ki 183±n/a nM
Citation Ho, GDBercovici, ATulshian, DGreenlee, WJFawzi, ASmith Torhan, AZhang, H Synthesis and structure-activity relationships of 4-hydroxy-4-phenylpiperidines as nociceptin receptor ligands: Part 1. Bioorg Med Chem Lett17:3023-7 (2007) 
 
Mu-type opioid receptor
Name:Mu-type opioid receptor
Type:G Protein-Coupled Receptor (GPCR)
Mol. Mass.:44789.51
Organism:Homo sapiens (Human)
Description:P35372
Residue:400
BDBM50210396
NameBDBM50210396
Synonyms:1-(bis(4-fluorophenyl)methyl)-4-phenylpiperidin-4-ol | CHEMBL228913
TypeSmall organic molecule
Emp. Form.C24H23F2NO
Mol. Mass.379.4423
SMILESOC1(CCN(CC1)C(c1ccc(F)cc1)c1ccc(F)cc1)c1ccccc1