Reaction Details
TargetNociceptin receptor
LigandBDBM50210379
Substrate/Competitorn/a
Meas. Tech.ChEMBL_438633 (CHEMBL888964)
Ki 162±n/a nM
Citation Ho, GDBercovici, ATulshian, DGreenlee, WJFawzi, ASmith Torhan, AZhang, H Synthesis and structure-activity relationships of 4-hydroxy-4-phenylpiperidines as nociceptin receptor ligands: Part 1. Bioorg Med Chem Lett17:3023-7 (2007) 
 
Nociceptin receptor
Name:Nociceptin receptor
Type:G Protein-Coupled Receptor (GPCR)
Mol. Mass.:40702.87
Organism:Homo sapiens (Human)
Description:P41146
Residue:370
BDBM50210379
NameBDBM50210379
Synonyms:1-benzhydryl-4-(benzyloxy)-4-phenylpiperidine | CHEMBL229018
TypeSmall organic molecule
Emp. Form.C31H31NO
Mol. Mass.433.5839
SMILESC(OC1(CCN(CC1)C(c1ccccc1)c1ccccc1)c1ccccc1)c1ccccc1