Reaction Details
TargetC-X-C chemokine receptor type 3
LigandBDBM50211135
Substrate/Competitorn/a
Meas. Tech.ChEMBL_438654 (CHEMBL888985)
IC50 2300±n/a nM
Citation Johnson, MLi, ARLiu, JFu, ZZhu, LMiao, SWang, XXu, QHuang, AMarcus, AXu, FEbsworth, KSablan, EDanao, JKumer, JDairaghi, DLawrence, CSullivan, TTonn, GSchall, TCollins, TMedina, J Discovery and optimization of a series of quinazolinone-derived antagonists of CXCR3. Bioorg Med Chem Lett17:3339-43 (2007) 
 
C-X-C chemokine receptor type 3
Name:C-X-C chemokine receptor type 3
Type:Enzyme Catalytic Domain
Mol. Mass.:40665.65
Organism:Homo sapiens (Human)
Description:n/a
Residue:368
BDBM50211135
NameBDBM50211135
Synonyms:2-biphenyl-4-yl-N-(2-ethoxy-ethyl)-N-[3-(4-ethoxy-phenyl)-4-oxo-3,4-dihydro-quinazolin-2-ylmethyl]-acetamide | CHEMBL231487
TypeSmall organic molecule
Emp. Form.C35H35N3O4
Mol. Mass.561.6701
SMILESCCOCCN(Cc1nc2ccccc2c(=O)n1-c1ccc(OCC)cc1)C(=O)Cc1ccc(cc1)-c1ccccc1