Reaction Details
TargetPhosphoenolpyruvate carboxykinase, cytosolic [GTP]
LigandBDBM50214007
Substrate/Competitorn/a
Meas. Tech.ChEMBL_438958 (CHEMBL889301)
EC50 5570±n/a nM
Citation Pietranico, SLFoley, LHHuby, NYun, WDunten, PVermeulen, JWang, PToth, KRamsey, GGubler, MLWertheimer, SJ C-8 Modifications of 3-alkyl-1,8-dibenzylxanthines as inhibitors of human cytosolic phosphoenolpyruvate carboxykinase. Bioorg Med Chem Lett17:3835-9 (2007) 
 
Phosphoenolpyruvate carboxykinase, cytosolic [GTP]
Name:Phosphoenolpyruvate carboxykinase, cytosolic [GTP]
Type:Protein
Mol. Mass.:69414.48
Organism:Rattus norvegicus (Rat)
Description:n/a
Residue:622
BDBM50214007
NameBDBM50214007
Synonyms:CHEMBL394621 | N-(4-((1-(2-fluorobenzyl)-3-(cyclopropylmethyl)-2,6-dioxo-2,3,6,7-tetrahydro-1H-purin-8-yl)methyl)phenyl)-1,3-dimethyl-1H-pyrazole-4-sulfonamide
TypeSmall organic molecule
Emp. Form.C28H28FN7O4S
Mol. Mass.577.63
SMILESCc1nn(C)cc1S(=O)(=O)Nc1ccc(Cc2nc3n(CC4CC4)c(=O)n(Cc4ccccc4F)c(=O)c3[nH]2)cc1