Reaction Details
TargetPotassium voltage-gated channel subfamily H member 2
LigandBDBM50117922
Substrate/Competitorn/a
Meas. Tech.ChEMBL_438966 (CHEMBL889314)
Ki 190±n/a nM
Citation Singleton, DHBoyd, HSteidl-Nichols, JVDeacon, MGroot, MJPrice, DNettleton, DOWallace, NKTroutman, MDWilliams, CBoyd, JG Fluorescently labeled analogues of dofetilide as high-affinity fluorescence polarization ligands for the human ether-a-go-go-related gene (hERG) channel. J Med Chem50:2931-41 (2007) 
 
Potassium voltage-gated channel subfamily H member 2
Name:Potassium voltage-gated channel subfamily H member 2
Type:Multi-pass membrane protein
Mol. Mass.:126672.65
Organism:Homo sapiens (Human)
Description:Q12809
Residue:1159
BDBM50117922
NameBDBM50117922
Synonyms:(1S,2S)-2-(2-((3-(1H-benzo[d]imidazol-2-yl)propyl)(methyl)amino)ethyl)-6-fluoro-1-isopropyl-1,2,3,4-tetrahydronaphthalen-2-yl 2-methoxyacetate CHEMBL45816 Methoxy-acetic acid (1S,2S)-2-(2-{[3-(1H-benzoimidazol-2-yl)-propyl]-methyl-amino}-ethyl)-6-fluoro-1-isopropyl-1,2,3,4-tetrahydro-naphthalen-2-yl ester Mibefradil dihydrochloride
TypeSmall organic molecule
Emp. Form.C29H38FN3O3
Mol. Mass.495.6287
SMILESCOCC(=O)O[C@]1(CCN(C)CCCc2nc3ccccc3[nH]2)CCc2cc(F)ccc2[C@@H]1C(C)C