Reaction Details
TargetPotassium voltage-gated channel subfamily H member 2
LigandBDBM50214363
Substrate/Competitorn/a
Meas. Tech.ChEMBL_438965 (CHEMBL889315)
Ki>1000±n/a nM
Citation Singleton, DHBoyd, HSteidl-Nichols, JVDeacon, MGroot, MJPrice, DNettleton, DOWallace, NKTroutman, MDWilliams, CBoyd, JG Fluorescently labeled analogues of dofetilide as high-affinity fluorescence polarization ligands for the human ether-a-go-go-related gene (hERG) channel. J Med Chem50:2931-41 (2007) 
 
Potassium voltage-gated channel subfamily H member 2
Name:Potassium voltage-gated channel subfamily H member 2
Type:Multi-pass membrane protein
Mol. Mass.:126672.65
Organism:Homo sapiens (Human)
Description:Q12809
Residue:1159
BDBM50214363
NameBDBM50214363
Synonyms:3',6'-bis(dimethylamino)-N-[2-(4-methanesulfonamidophenoxy)ethyl]-N-[2-(4-methanesulfonamidophenyl)ethyl]-3-oxo-3H-spiro[2-benzofuran-1,9'-xanthene]-5-carboxamide | CHEMBL375513
TypeSmall organic molecule
Emp. Form.C43H45N5O9S2
Mol. Mass.839.976
SMILESCN(C)c1ccc2c(Oc3cc(ccc3C22OC(=O)c3cc(ccc23)C(=O)N(CCOc2ccc(NS(C)(=O)=O)cc2)CCc2ccc(NS(C)(=O)=O)cc2)N(C)C)c1