Reaction Details
TargetRmtA
LigandBDBM50215479
Substrate/Competitorn/a
Meas. Tech.ChEMBL_439623 (CHEMBL888739)
IC50 46200±n/a nM
Citation Spannhoff, AMachmur, RHeinke, RTrojer, PBauer, IBrosch, GSchüle, RHanefeld, WSippl, WJung, M A novel arginine methyltransferase inhibitor with cellular activity. Bioorg Med Chem Lett17:4150-3 (2007) 
 
RmtA
Name:RmtA
Synonyms:n/a
Type:PROTEIN
Mol. Mass.:39351.26
Organism:Emericella nidulans
Description:ChEMBL_475539
Residue:345
BDBM50215479
NameBDBM50215479
TypeSmall organic molecule
Emp. Form.C34H32N2O4S2
Mol. Mass.596.759
SMILESCC(SC1c2ccccc2Oc2ccccc12)C(=O)NCCNC(=O)C(C)SC1c2ccccc2Oc2ccccc12