Reaction Details
TargetRmtA
LigandBDBM50371091
Substrate/Competitorn/a
Meas. Tech.ChEMBL_439623 (CHEMBL888739)
IC50 46800±n/a nM
Citation Spannhoff, AMachmur, RHeinke, RTrojer, PBauer, IBrosch, GSchüle, RHanefeld, WSippl, WJung, M A novel arginine methyltransferase inhibitor with cellular activity. Bioorg Med Chem Lett17:4150-3 (2007) 
 
RmtA
Name:RmtA
Synonyms:n/a
Type:PROTEIN
Mol. Mass.:39351.26
Organism:Emericella nidulans
Description:ChEMBL_475539
Residue:345
BDBM50371091
NameBDBM50371091
Synonyms:CHEMBL228549
TypeSmall organic molecule
Emp. Form.C6H14N2OS
Mol. Mass.162.253
SMILESCC(S)C(=O)NCCCN