Reaction Details
Target72 kDa type IV collagenase
LigandBDBM8465
Substrate/Competitorn/a
Meas. Tech.ChEMBL_441088 (CHEMBL891302)
IC50 24±n/a nM
Citation Santos, MAEnyedy, EANuti, ERossello, AKrupenko, NIKrupenko, SA Methotrexate gamma-hydroxamate derivatives as potential dual target antitumor drugs. Bioorg Med Chem15:1266-74 (2007) 
 
72 kDa type IV collagenase
Name:72 kDa type IV collagenase
Type:Enzyme
Mol. Mass.:73870.36
Organism:Homo sapiens (Human)
Description: P08253
Residue:660
BDBM8465
NameBDBM8465
Synonyms:(2R)-N-hydroxy-2-[(4-methoxybenzene)(pyridin-3-ylmethyl)sulfonamido]-3-methylbutanamide CGS 27023 CHEMBL514138 | hydroxamate analogue 1
TypeSmall organic molecule
Emp. Form.C18H23N3O5S
Mol. Mass.393.457
SMILESCOc1ccc(cc1)S(=O)(=O)N(Cc1cccnc1)[C@H](C(C)C)C(=O)NO