Reaction Details
TargetBroad substrate specificity ATP-binding cassette transporter ABCG2
LigandBDBM50206310
Substrate/Competitorn/a
Meas. Tech.ChEMBL_442566 (CHEMBL892735)
IC50 410±n/a nM
Citation Boumendjel, AMacalou, SAhmed-Belkacem, ABlanc, MDi Pietro, A Acridone derivatives: design, synthesis, and inhibition of breast cancer resistance protein ABCG2. Bioorg Med Chem15:2892-7 (2007) 
 
Broad substrate specificity ATP-binding cassette transporter ABCG2
Name:Broad substrate specificity ATP-binding cassette transporter ABCG2
Type:Multi-pass membrane protein; monomer or homodimer; disulfide-linked
Mol. Mass.:72329.48
Organism:Homo sapiens (Human)
Description:Q9UNQ0
Residue:655
BDBM50206310
NameBDBM50206310
Synonyms:5-Methoxy-9-oxo-9,10-dihydro-acridine-4-carboxylic acid {4-[2-(6,7-dimethoxy-3,4-dihydro-1H-isoquinolin-2-yl)-ethyl]-phenyl}-amide ELACRIDAR HYDROCHLORIDE N-(4-(2-(6,7-dimethoxy-3,4-dihydroisoquinolin-2(1H)-yl)ethyl)phenyl)-5-methoxy-9-oxo-9,10-dihydroacridine-2-carboxamide N-4-[2-(1,2,3,4-Tetrahydro-6,7-dimethoxy-2-isoquinolinyl)ethyl]phenyl}-9,10-dihydro-5-methoxy-9-oxo-4-acridone carboxamide | US11739089, Compound Elacridar
TypeSmall organic molecule
Emp. Form.C34H33N3O5
Mol. Mass.563.6429
SMILESCOc1cc2CCN(CCc3ccc(NC(=O)c4cccc5c4[nH]c4c(OC)cccc4c5=O)cc3)Cc2cc1OC