Reaction Details
TargetCarbonic anhydrase 2
LigandBDBM50208749
Substrate/Competitorn/a
Meas. Tech.ChEMBL_443316 (CHEMBL893564)
Ki 10±n/a nM
Citation Winum, JYThiry, ACheikh, KEDogné, JMMontero, JLVullo, DScozzafava, AMasereel, BSupuran, CT Carbonic anhydrase inhibitors. Inhibition of isoforms I, II, IV, VA, VII, IX, and XIV with sulfonamides incorporating fructopyranose-thioureido tails. Bioorg Med Chem Lett17:2685-91 (2007) 
 
Carbonic anhydrase 2
Name:Carbonic anhydrase 2
Type:Enzyme
Mol. Mass.:29250.71
Organism:Homo sapiens (Human)
Description:P00918
Residue:260
BDBM50208749
NameBDBM50208749
Synonyms:1-[2-(4-sulfamoylphenyl)ethyl]-3-{[(1R,2S,6S,9R)-4,4,11,11-tetramethyl-3,5,7,10,12-pentaoxatricyclo[7.3.0.0^{2,6}]dodecan-6-yl]methyl}thiourea | CHEMBL390035
TypeSmall organic molecule
Emp. Form.C21H31N3O7S2
Mol. Mass.501.617
SMILESCC1(C)O[C@@H]2CO[C@@]3(CNC(=S)NCCc4ccc(cc4)S(N)(=O)=O)OC(C)(C)O[C@H]3[C@@H]2O1