Reaction Details
TargetCarbonic anhydrase 1
LigandBDBM50208751
Substrate/Competitorn/a
Meas. Tech.ChEMBL_443315 (CHEMBL893563)
Ki 11000±n/a nM
Citation Winum, JYThiry, ACheikh, KEDogné, JMMontero, JLVullo, DScozzafava, AMasereel, BSupuran, CT Carbonic anhydrase inhibitors. Inhibition of isoforms I, II, IV, VA, VII, IX, and XIV with sulfonamides incorporating fructopyranose-thioureido tails. Bioorg Med Chem Lett17:2685-91 (2007) 
 
Carbonic anhydrase 1
Name:Carbonic anhydrase 1
Type:Enzyme
Mol. Mass.:28873.37
Organism:Homo sapiens (Human)
Description:P00915
Residue:261
BDBM50208751
NameBDBM50208751
Synonyms:1-(2-fluoro-4-sulfamoylphenyl)-3-{[(1R,2S,6S,9R)-4,4,11,11-tetramethyl-3,5,7,10,12-pentaoxatricyclo[7.3.0.0^{2,6}]dodecan-6-yl]methyl}thiourea | CHEMBL233019
TypeSmall organic molecule
Emp. Form.C19H26FN3O7S2
Mol. Mass.491.554
SMILESCC1(C)O[C@@H]2CO[C@@]3(CNC(=S)Nc4ccc(cc4F)S(N)(=O)=O)OC(C)(C)O[C@H]3[C@@H]2O1