Reaction Details
TargetCarbonic anhydrase 7
LigandBDBM50208755
Substrate/Competitorn/a
Meas. Tech.ChEMBL_443319 (CHEMBL893567)
Ki 18±n/a nM
Citation Winum, JYThiry, ACheikh, KEDogné, JMMontero, JLVullo, DScozzafava, AMasereel, BSupuran, CT Carbonic anhydrase inhibitors. Inhibition of isoforms I, II, IV, VA, VII, IX, and XIV with sulfonamides incorporating fructopyranose-thioureido tails. Bioorg Med Chem Lett17:2685-91 (2007) 
 
Carbonic anhydrase 7
Name:Carbonic anhydrase 7
Type:Enzyme
Mol. Mass.:29664.11
Organism:Homo sapiens (Human)
Description:Human cloned isozyme.
Residue:264
BDBM50208755
NameBDBM50208755
Synonyms:1-(2-chloro-4-sulfamoylphenyl)-3-{[(1R,2S,6S,9R)-4,4,11,11-tetramethyl-3,5,7,10,12-pentaoxatricyclo[7.3.0.0^{2,6}]dodecan-6-yl]methyl}thiourea | CHEMBL232816
TypeSmall organic molecule
Emp. Form.C19H26ClN3O7S2
Mol. Mass.508.009
SMILESCC1(C)O[C@@H]2CO[C@@]3(CNC(=S)Nc4ccc(cc4Cl)S(N)(=O)=O)OC(C)(C)O[C@H]3[C@@H]2O1