Reaction Details
TargetCarbonic anhydrase 9
LigandBDBM50208752
Substrate/Competitorn/a
Meas. Tech.ChEMBL_443320 (CHEMBL893568)
Ki 4500±n/a nM
Citation Winum, JYThiry, ACheikh, KEDogné, JMMontero, JLVullo, DScozzafava, AMasereel, BSupuran, CT Carbonic anhydrase inhibitors. Inhibition of isoforms I, II, IV, VA, VII, IX, and XIV with sulfonamides incorporating fructopyranose-thioureido tails. Bioorg Med Chem Lett17:2685-91 (2007) 
 
Carbonic anhydrase 9
Name:Carbonic anhydrase 9
Type:Enzyme
Mol. Mass.:49669.03
Organism:Homo sapiens (Human)
Description:Catalytic domain of human cloned isozyme was used in the assay
Residue:459
BDBM50208752
NameBDBM50208752
Synonyms:1-(3-sulfamoylphenyl)-3-{[(1R,2S,6S,9R)-4,4,11,11-tetramethyl-3,5,7,10,12-pentaoxatricyclo[7.3.0.0^{2,6}]dodecan-6-yl]methyl}thiourea | CHEMBL232617
TypeSmall organic molecule
Emp. Form.C19H27N3O7S2
Mol. Mass.473.564
SMILESCC1(C)O[C@@H]2CO[C@@]3(CNC(=S)Nc4cccc(c4)S(N)(=O)=O)OC(C)(C)O[C@H]3[C@@H]2O1