Reaction Details
TargetBeta-lactamase SHV-1
LigandBDBM50218936
Substrate/Competitorn/a
Meas. Tech.ChEMBL_445225 (CHEMBL894369)
IC50 152±n/a nM
Citation Plantan, ISelic, LMesar, TAnderluh, PSOblak, MPrezelj, AHesse, LAndrejasic, MVilar, MTurk, DKocijan, APrevec, TVilfan, GKocjan, DCopar, AUrleb, USolmajer, T 4-Substituted trinems as broad spectrum beta-lactamase inhibitors: structure-based design, synthesis, and biological activity. J Med Chem50:4113-21 (2007) 
 
Beta-lactamase SHV-1
Name:Beta-lactamase SHV-1
Type:Protein
Mol. Mass.:31226.68
Organism:Klebsiella pneumoniae (Enterobacteria)
Description:4R3B
Residue:286
BDBM50218936
NameBDBM50218936
Synonyms:CHEMBL397438 | sodium (8S,9R)-10(E)-ethylidene-4(S)-(2'-cyanoethoxy)-11-oxo-1-azatricyclo[7.2.0.03, 8]undec-2-enecarboxylate
TypeSmall organic molecule
Emp. Form.C16H17N2O4
Mol. Mass.301.3177
SMILESC\C=C1/[C@H]2[C@H]3CCC[C@H](OCCC#N)C3=C(N2C1=O)C([O-])=O