Reaction Details
TargetBeta-lactamase SHV-1
LigandBDBM50218939
Substrate/Competitorn/a
Meas. Tech.ChEMBL_445225 (CHEMBL894369)
IC50 206±n/a nM
Citation Plantan, ISelic, LMesar, TAnderluh, PSOblak, MPrezelj, AHesse, LAndrejasic, MVilar, MTurk, DKocijan, APrevec, TVilfan, GKocjan, DCopar, AUrleb, USolmajer, T 4-Substituted trinems as broad spectrum beta-lactamase inhibitors: structure-based design, synthesis, and biological activity. J Med Chem50:4113-21 (2007) 
 
Beta-lactamase SHV-1
Name:Beta-lactamase SHV-1
Type:Protein
Mol. Mass.:31226.68
Organism:Klebsiella pneumoniae (Enterobacteria)
Description:4R3B
Residue:286
BDBM50218939
NameBDBM50218939
Synonyms:CHEMBL230332 | sodium (5S,8aS,8bR)-5-butoxy-1-eth-(E)-ylidene-2-oxo-1,2,5,6,7,8,8a,8b-octahydro-azeto[2,1-a]isoindole-4-carboxylate
TypeSmall organic molecule
Emp. Form.C17H22NO4
Mol. Mass.304.3614
SMILESCCCCO[C@H]1CCC[C@@H]2[C@H]3N(C(=O)\C3=C\C)C(C([O-])=O)=C12