Reaction Details
TargetEstrogen receptor beta
LigandBDBM50169743
Substrate/Competitorn/a
Meas. Tech.ChEMBL_445591 (CHEMBL895879)
IC50 44.1±n/a nM
Citation Zhao, LJin, CMao, ZGopinathan, MBRehder, KBrinton, RD Design, synthesis, and estrogenic activity of a novel estrogen receptor modulator--a hybrid structure of 17beta-estradiol and vitamin E in hippocampal neurons. J Med Chem50:4471-81 (2007) 
 
Estrogen receptor beta
Name:Estrogen receptor beta
Type:Protein
Mol. Mass.:59238.43
Organism:Homo sapiens (Human)
Description:Q92731
Residue:530
BDBM50169743
NameBDBM50169743
Synonyms:(13S,17S)-13-Methyl-7-[9-(4,4,5,5,5-pentafluoro-pentane-1-sulfinyl)-nonyl]-7,8,9,11,12,13,14,15,16,17-decahydro-6H-cyclopenta[a]phenanthrene-3,17-diol (7R,13S,17S)-13-methyl-7-(9-(4,4,5,5,5-pentafluoropentylsulfinyl)nonyl)-7,8,9,11,12,13,14,15,16,17-decahydro-6H-cyclopenta[a]phenanthrene-3,17-diol (7R,8R,9S,13S,14S,17S)-13-methyl-7-(9-(4,4,5,5,5-pentafluoropentyldihydrosulfinyl)nonyl)-7,8,9,11,12,13,14,15,16,17-decahydro-6H-cyclopenta[a]phenanthrene-3,17-diol 13-Methyl-7-[9-(4,4,5,5,5-pentafluoro-pentane-1-sulfinyl)-nonyl]-7,8,9,11,12,13,14,15,16,17-decahydro-6H-cyclopenta[a]phenanthrene-3,17-diol FULVESTRANT Fluvestrant US10227334, Fulvestrant ZD-9238
TypeSmall organic molecule
Emp. Form.C32H47F5O3S
Mol. Mass.606.771
SMILESC[C@]12CC[C@H]3[C@H]([C@@H]1CC[C@@H]2O)[C@H](CCCCCCCCCS(=O)CCCC(F)(F)C(F)(F)F)Cc1cc(O)ccc31