Reaction Details
TargetTrans-2-enoyl-ACP reductase II
LigandBDBM8726
Substrate/Competitorn/a
Meas. Tech.ChEMBL_445899 (CHEMBL896189)
IC50>32000±n/a nM
Citation Kitagawa, HOzawa, TTakahata, SIida, MSaito, JYamada, M Phenylimidazole derivatives of 4-pyridone as dual inhibitors of bacterial enoyl-acyl carrier protein reductases FabI and FabK. J Med Chem50:4710-20 (2007) 
 
Trans-2-enoyl-ACP reductase II
Name:Trans-2-enoyl-ACP reductase II
Type:Enzyme
Mol. Mass.:34170.89
Organism:Streptococcus pneumoniae
Description:n/a
Residue:324
BDBM8726
NameBDBM8726
Synonyms:5-chloro-2-(2,4-dichlorophenoxy)phenol TCL US20230414581, Compound 35
TypeSmall organic molecule
Emp. Form.C12H7Cl3O2
Mol. Mass.289.542
SMILESOc1cc(Cl)ccc1Oc1ccc(Cl)cc1Cl