Reaction Details
TargetMetabotropic glutamate receptor 2
LigandBDBM17657
Substrate/Competitorn/a
Meas. Tech.ChEMBL_446049 (CHEMBL895145)
Ki 11000±n/a nM
Citation Pellicciari, RMarinozzi, MMacchiarulo, AFulco, MCGafarova, JSerpi, MGiorgi, GNielsen, SThomsen, C Synthesis, molecular modeling studies, and preliminary pharmacological characterization of all possible 2-(2'-sulfonocyclopropyl)glycine stereoisomers as conformationally constrained L-homocysteic acid analogs. J Med Chem50:4630-41 (2007) 
 
Metabotropic glutamate receptor 2
Name:Metabotropic glutamate receptor 2
Type:Enzyme
Mol. Mass.:95584.88
Organism:Homo sapiens (Human)
Description:Q14416
Residue:872
BDBM17657
NameBDBM17657
Synonyms:(2S)-2-aminopentanedioic acid D-Glutamate L-Glu L-Glutamic acid L-gluatmate
TypeAmino Acid
Emp. Form.C5H9NO4
Mol. Mass.147.1293
SMILESN[C@@H](CCC(O)=O)C(O)=O