Reaction Details
TargetCoagulation factor X
LigandBDBM50216561
Substrate/Competitorn/a
Meas. Tech.ChEMBL_447824 (CHEMBL898074)
Ki 13±n/a nM
Citation Qiao, JXChang, CHCheney, DLMorin, PEWang, GZKing, SRWang, TCRendina, ARLuettgen, JMKnabb, RMWexler, RRLam, PY SAR and X-ray structures of enantiopure 1,2-cis-(1R,2S)-cyclopentyldiamine and cyclohexyldiamine derivatives as inhibitors of coagulation Factor Xa. Bioorg Med Chem Lett17:4419-27 (2007) 
 
Coagulation factor X
Name:Coagulation factor X
Type:Enzyme
Mol. Mass.:54726.60
Organism:Homo sapiens (Human)
Description:n/a
Residue:488
BDBM50216561
NameBDBM50216561
Synonyms:3-chloro-N-(2-(4-(2-oxopyridin-1(2H)-yl)benzamido)ethyl)-1H-indole-6-carboxamide | CHEMBL231749
TypeSmall organic molecule
Emp. Form.C23H19ClN4O3
Mol. Mass.434.875
SMILESClc1c[nH]c2cc(ccc12)C(=O)NCCNC(=O)c1ccc(cc1)-n1ccccc1=O