Reaction Details
TargetCoagulation factor X
LigandBDBM50216592
Substrate/Competitorn/a
Meas. Tech.ChEMBL_447824 (CHEMBL898074)
Ki 10±n/a nM
Citation Qiao, JXChang, CHCheney, DLMorin, PEWang, GZKing, SRWang, TCRendina, ARLuettgen, JMKnabb, RMWexler, RRLam, PY SAR and X-ray structures of enantiopure 1,2-cis-(1R,2S)-cyclopentyldiamine and cyclohexyldiamine derivatives as inhibitors of coagulation Factor Xa. Bioorg Med Chem Lett17:4419-27 (2007) 
 
Coagulation factor X
Name:Coagulation factor X
Type:Enzyme
Mol. Mass.:54726.60
Organism:Homo sapiens (Human)
Description:n/a
Residue:488
BDBM50216592
NameBDBM50216592
Synonyms:CHEMBL440969 | cis-1-(4-chlorophenyl)-3-(2-(4-(2-oxopyridin-1(2H)-yl)benzamido)cyclopentyl)urea
TypeSmall organic molecule
Emp. Form.C24H23ClN4O3
Mol. Mass.450.917
SMILESClc1ccc(NC(=O)N[C@@H]2CCC[C@@H]2NC(=O)c2ccc(cc2)-n2ccccc2=O)cc1