Reaction Details
TargetCoagulation factor X
LigandBDBM50216591
Substrate/Competitorn/a
Meas. Tech.ChEMBL_447824 (CHEMBL898074)
Ki 2.8±n/a nM
Citation Qiao, JXChang, CHCheney, DLMorin, PEWang, GZKing, SRWang, TCRendina, ARLuettgen, JMKnabb, RMWexler, RRLam, PY SAR and X-ray structures of enantiopure 1,2-cis-(1R,2S)-cyclopentyldiamine and cyclohexyldiamine derivatives as inhibitors of coagulation Factor Xa. Bioorg Med Chem Lett17:4419-27 (2007) 
 
Coagulation factor X
Name:Coagulation factor X
Type:Enzyme
Mol. Mass.:54726.60
Organism:Homo sapiens (Human)
Description:n/a
Residue:488
BDBM50216591
NameBDBM50216591
Synonyms:5-chloro-N-((1R,2S)-2-(4-(2-((dimethylamino)methyl)-1H-imidazol-1-yl)benzamido)cyclopentyl)thiophene-2-carboxamide | CHEMBL398998
TypeSmall organic molecule
Emp. Form.C23H26ClN5O2S
Mol. Mass.472.003
SMILESCN(C)Cc1nccn1-c1ccc(cc1)C(=O)N[C@H]1CCC[C@H]1NC(=O)c1ccc(Cl)s1