Reaction Details
TargetCoagulation factor X
LigandBDBM50216597
Substrate/Competitorn/a
Meas. Tech.ChEMBL_447824 (CHEMBL898074)
Ki 3.2±n/a nM
Citation Qiao, JXChang, CHCheney, DLMorin, PEWang, GZKing, SRWang, TCRendina, ARLuettgen, JMKnabb, RMWexler, RRLam, PY SAR and X-ray structures of enantiopure 1,2-cis-(1R,2S)-cyclopentyldiamine and cyclohexyldiamine derivatives as inhibitors of coagulation Factor Xa. Bioorg Med Chem Lett17:4419-27 (2007) 
 
Coagulation factor X
Name:Coagulation factor X
Type:Enzyme
Mol. Mass.:54726.60
Organism:Homo sapiens (Human)
Description:n/a
Residue:488
BDBM50216597
NameBDBM50216597
Synonyms:5-chloro-N-(2-methyl-1-(4-(2-oxopyridin-1(2H)-yl)benzamido)propan-2-yl)thiophene-2-carboxamide | CHEMBL234812
TypeSmall organic molecule
Emp. Form.C21H20ClN3O3S
Mol. Mass.429.92
SMILESCC(C)(CNC(=O)c1ccc(cc1)-n1ccccc1=O)NC(=O)c1ccc(Cl)s1