Reaction Details
TargetCoagulation factor X
LigandBDBM50216610
Substrate/Competitorn/a
Meas. Tech.ChEMBL_447824 (CHEMBL898074)
Ki 603±n/a nM
Citation Qiao, JXChang, CHCheney, DLMorin, PEWang, GZKing, SRWang, TCRendina, ARLuettgen, JMKnabb, RMWexler, RRLam, PY SAR and X-ray structures of enantiopure 1,2-cis-(1R,2S)-cyclopentyldiamine and cyclohexyldiamine derivatives as inhibitors of coagulation Factor Xa. Bioorg Med Chem Lett17:4419-27 (2007) 
 
Coagulation factor X
Name:Coagulation factor X
Type:Enzyme
Mol. Mass.:54726.60
Organism:Homo sapiens (Human)
Description:n/a
Residue:488
BDBM50216610
NameBDBM50216610
Synonyms:4-chloro-2-methyl-N-{(1R,2S)-2-[4-(2-oxo-2H-pyridin-1-yl)-benzoylamino]-cyclopentyl}-benzamide | CHEMBL232922
TypeSmall organic molecule
Emp. Form.C25H24ClN3O3
Mol. Mass.449.929
SMILESCc1cc(Cl)ccc1C(=O)N[C@@H]1CCC[C@@H]1NC(=O)c1ccc(cc1)-n1ccccc1=O