Reaction Details
TargetCoagulation factor X
LigandBDBM50216614
Substrate/Competitorn/a
Meas. Tech.ChEMBL_447824 (CHEMBL898074)
Ki 4.7±n/a nM
Citation Qiao, JXChang, CHCheney, DLMorin, PEWang, GZKing, SRWang, TCRendina, ARLuettgen, JMKnabb, RMWexler, RRLam, PY SAR and X-ray structures of enantiopure 1,2-cis-(1R,2S)-cyclopentyldiamine and cyclohexyldiamine derivatives as inhibitors of coagulation Factor Xa. Bioorg Med Chem Lett17:4419-27 (2007) 
 
Coagulation factor X
Name:Coagulation factor X
Type:Enzyme
Mol. Mass.:54726.60
Organism:Homo sapiens (Human)
Description:n/a
Residue:488
BDBM50216614
NameBDBM50216614
Synonyms:CHEMBL393521 | cis-5-chloro-N-(2-(2-fluoro-4-(2-oxopyridin-1(2H)-yl)benzamido)cyclopentyl)thiophene-2-carboxamide
TypeSmall organic molecule
Emp. Form.C22H19ClFN3O3S
Mol. Mass.459.921
SMILESFc1cc(ccc1C(=O)N[C@H]1CCC[C@H]1NC(=O)c1ccc(Cl)s1)-n1ccccc1=O