Reaction Details
TargetCoagulation factor X
LigandBDBM50216625
Substrate/Competitorn/a
Meas. Tech.ChEMBL_447824 (CHEMBL898074)
Ki 2610±n/a nM
Citation Qiao, JXChang, CHCheney, DLMorin, PEWang, GZKing, SRWang, TCRendina, ARLuettgen, JMKnabb, RMWexler, RRLam, PY SAR and X-ray structures of enantiopure 1,2-cis-(1R,2S)-cyclopentyldiamine and cyclohexyldiamine derivatives as inhibitors of coagulation Factor Xa. Bioorg Med Chem Lett17:4419-27 (2007) 
 
Coagulation factor X
Name:Coagulation factor X
Type:Enzyme
Mol. Mass.:54726.60
Organism:Homo sapiens (Human)
Description:n/a
Residue:488
BDBM50216625
NameBDBM50216625
Synonyms:CHEMBL232530 | N-[(1S,2R)-2-[(2-chlorobenzene)amido]cyclopentyl]-4-(2-oxo-1,2-dihydropyridin-1-yl)benzamide
TypeSmall organic molecule
Emp. Form.C24H22ClN3O3
Mol. Mass.435.903
SMILESClc1ccccc1C(=O)N[C@@H]1CCC[C@@H]1NC(=O)c1ccc(cc1)-n1ccccc1=O