Reaction Details
TargetCoagulation factor X
LigandBDBM50216617
Substrate/Competitorn/a
Meas. Tech.ChEMBL_447824 (CHEMBL898074)
Ki 8.1±n/a nM
Citation Qiao, JXChang, CHCheney, DLMorin, PEWang, GZKing, SRWang, TCRendina, ARLuettgen, JMKnabb, RMWexler, RRLam, PY SAR and X-ray structures of enantiopure 1,2-cis-(1R,2S)-cyclopentyldiamine and cyclohexyldiamine derivatives as inhibitors of coagulation Factor Xa. Bioorg Med Chem Lett17:4419-27 (2007) 
 
Coagulation factor X
Name:Coagulation factor X
Type:Enzyme
Mol. Mass.:54726.60
Organism:Homo sapiens (Human)
Description:n/a
Residue:488
BDBM50216617
NameBDBM50216617
Synonyms:3-chloro-N-((1R,2S)-2-(4-(2-oxopyrrolidin-1-yl)benzamido)cyclohexyl)-1H-indole-6-carboxamide | CHEMBL428899
TypeSmall organic molecule
Emp. Form.C26H27ClN4O3
Mol. Mass.478.971
SMILESClc1c[nH]c2cc(ccc12)C(=O)N[C@@H]1CCCC[C@@H]1NC(=O)c1ccc(cc1)N1CCCC1=O