Reaction Details
TargetCoagulation factor X
LigandBDBM50216619
Substrate/Competitorn/a
Meas. Tech.ChEMBL_447824 (CHEMBL898074)
Ki 11500±n/a nM
Citation Qiao, JXChang, CHCheney, DLMorin, PEWang, GZKing, SRWang, TCRendina, ARLuettgen, JMKnabb, RMWexler, RRLam, PY SAR and X-ray structures of enantiopure 1,2-cis-(1R,2S)-cyclopentyldiamine and cyclohexyldiamine derivatives as inhibitors of coagulation Factor Xa. Bioorg Med Chem Lett17:4419-27 (2007) 
 
Coagulation factor X
Name:Coagulation factor X
Type:Enzyme
Mol. Mass.:54726.60
Organism:Homo sapiens (Human)
Description:n/a
Residue:488
BDBM50216619
NameBDBM50216619
Synonyms:CHEMBL410550 | cis-N-(2-(4-chlorophenylsulfonamido)cyclopentyl)-4-(2-oxopyridin-1(2H)-yl)benzamide
TypeSmall organic molecule
Emp. Form.C23H22ClN3O4S
Mol. Mass.471.956
SMILESClc1ccc(cc1)S(=O)(=O)N[C@@H]1CCC[C@@H]1NC(=O)c1ccc(cc1)-n1ccccc1=O