Reaction Details
TargetPolyunsaturated fatty acid lipoxygenase ALOX15
LigandBDBM50158387
Substrate/Competitorn/a
Meas. Tech.ChEMBL_449593 (CHEMBL898688)
IC50>25000±n/a nM
Citation Deschamps, JDGautschi, JTWhitman, SJohnson, TAGassner, NCCrews, PHolman, TR Discovery of platelet-type 12-human lipoxygenase selective inhibitors by high-throughput screening of structurally diverse libraries. Bioorg Med Chem15:6900-8 (2007) 
 
Polyunsaturated fatty acid lipoxygenase ALOX15
Name:Polyunsaturated fatty acid lipoxygenase ALOX15
Type:Protein
Mol. Mass.:74804.05
Organism:Homo sapiens (Human)
Description:n/a
Residue:662
BDBM50158387
NameBDBM50158387
Synonyms:4-[(3-carboxy-4-hydroxy-1-naphthyl)(oxo)acetyl]-1-hydroxy-2-naphthoic acid NSC-292213
TypeSmall organic molecule
Emp. Form.C24H14O8
Mol. Mass.430.3632
SMILESOC(=O)c1cc(C(=O)C(=O)c2cc(C(O)=O)c(O)c3ccccc23)c2ccccc2c1O