Reaction Details
TargetPolyunsaturated fatty acid lipoxygenase ALOX12
LigandBDBM50221404
Substrate/Competitorn/a
Meas. Tech.ChEMBL_449592 (CHEMBL898687)
IC50>100000±n/a nM
Citation Deschamps, JDGautschi, JTWhitman, SJohnson, TAGassner, NCCrews, PHolman, TR Discovery of platelet-type 12-human lipoxygenase selective inhibitors by high-throughput screening of structurally diverse libraries. Bioorg Med Chem15:6900-8 (2007) 
 
Polyunsaturated fatty acid lipoxygenase ALOX12
Name:Polyunsaturated fatty acid lipoxygenase ALOX12
Type:Protein
Mol. Mass.:75689.18
Organism:Homo sapiens (Human)
Description:P18054
Residue:663
BDBM50221404
NameBDBM50221404
Synonyms:CHEMBL392270 | neodysidenin
TypeSmall organic molecule
Emp. Form.C17H23Cl6N3O2S
Mol. Mass.546.166
SMILESC[C@@H](C[C@H](NC(=O)C[C@H](C)C(Cl)(Cl)Cl)C(=O)N(C)[C@H](C)c1nccs1)C(Cl)(Cl)Cl