Reaction Details
TargetNuclear receptor subfamily 4 group A member 2
LigandBDBM50196289
Substrate/Competitorn/a
Meas. Tech.ChEMBL_453027 (CHEMBL902174)
EC50 4.1±n/a nM
Citation Hintermann, SChiesi, Mvon Krosigk, UMathé, DFelber, RHengerer, B Identification of a series of highly potent activators of the Nurr1 signaling pathway. Bioorg Med Chem Lett17:193-6 (2006) 
 
Nuclear receptor subfamily 4 group A member 2
Name:Nuclear receptor subfamily 4 group A member 2
Type:PROTEIN
Mol. Mass.:66603.77
Organism:Homo sapiens (Human)
Description:ChEMBL_453027
Residue:598
BDBM50196289
NameBDBM50196289
Synonyms:6-(4-methoxyphenyl)-5-methyl-3-phenylisoxazolo[4,5-c]pyridin-4(5H)-one | CHEMBL399602
TypeSmall organic molecule
Emp. Form.C20H16N2O3
Mol. Mass.332.3526
SMILESCOc1ccc(cc1)-c1cc2onc(-c3ccccc3)c2c(=O)n1C