Reaction Details
TargetC-X-C chemokine receptor type 2
LigandBDBM50203003
Substrate/Competitorn/a
Meas. Tech.ChEMBL_454110 (CHEMBL903301)
IC50 15±n/a nM
Citation McCleland, BWDavis, RSPalovich, MRWiddowson, KLWerner, MLBurman, MFoley, JJSchmidt, DBSarau, HMRogers, MSalyers, KLGorycki, PDRoethke, TJStelman, GJAzzarano, LMWard, KWBusch-Petersen, J Comparison of N,N'-diarylsquaramides and N,N'-diarylureas as antagonists of the CXCR2 chemokine receptor. Bioorg Med Chem Lett17:1713-7 (2007) 
 
C-X-C chemokine receptor type 2
Name:C-X-C chemokine receptor type 2
Type:Protein
Mol. Mass.:40767.88
Organism:Homo sapiens (Human)
Description:P25025
Residue:360
BDBM50203003
NameBDBM50203003
Synonyms:4-(2-(2-bromophenylamino)-3,4-dioxocyclobut-1-enylamino)-3-hydroxybenzonitrile | CHEMBL239136
TypeSmall organic molecule
Emp. Form.C17H10BrN3O3
Mol. Mass.384.184
SMILESOc1cc(ccc1Nc1c(Nc2ccccc2Br)c(=O)c1=O)C#N