Reaction Details
TargetC-X-C chemokine receptor type 2
LigandBDBM50203006
Substrate/Competitorn/a
Meas. Tech.ChEMBL_454110 (CHEMBL903301)
IC50 18±n/a nM
Citation McCleland, BWDavis, RSPalovich, MRWiddowson, KLWerner, MLBurman, MFoley, JJSchmidt, DBSarau, HMRogers, MSalyers, KLGorycki, PDRoethke, TJStelman, GJAzzarano, LMWard, KWBusch-Petersen, J Comparison of N,N'-diarylsquaramides and N,N'-diarylureas as antagonists of the CXCR2 chemokine receptor. Bioorg Med Chem Lett17:1713-7 (2007) 
 
C-X-C chemokine receptor type 2
Name:C-X-C chemokine receptor type 2
Type:Protein
Mol. Mass.:40767.88
Organism:Homo sapiens (Human)
Description:P25025
Residue:360
BDBM50203006
NameBDBM50203006
Synonyms:3-(4-chloro-2-hydroxy-3-(4-(piperidin-1-yl)piperidin-1-ylsulfonyl)phenylamino)-4-(phenylamino)cyclobut-3-ene-1,2-dione hydrochloride | CHEMBL537883
TypeSmall organic molecule
Emp. Form.C26H29ClN4O5S
Mol. Mass.545.05
SMILESOc1c(Nc2c(Nc3ccccc3)c(=O)c2=O)ccc(Cl)c1S(=O)(=O)N1CCC(CC1)N1CCCCC1