Reaction Details
TargetC-X-C chemokine receptor type 2
LigandBDBM50203017
Substrate/Competitorn/a
Meas. Tech.ChEMBL_454110 (CHEMBL903301)
IC50 28±n/a nM
Citation McCleland, BWDavis, RSPalovich, MRWiddowson, KLWerner, MLBurman, MFoley, JJSchmidt, DBSarau, HMRogers, MSalyers, KLGorycki, PDRoethke, TJStelman, GJAzzarano, LMWard, KWBusch-Petersen, J Comparison of N,N'-diarylsquaramides and N,N'-diarylureas as antagonists of the CXCR2 chemokine receptor. Bioorg Med Chem Lett17:1713-7 (2007) 
 
C-X-C chemokine receptor type 2
Name:C-X-C chemokine receptor type 2
Type:Protein
Mol. Mass.:40767.88
Organism:Homo sapiens (Human)
Description:P25025
Residue:360
BDBM50203017
NameBDBM50203017
Synonyms:3-(2-bromophenylamino)-4-(4-chloro-2-hydroxy-3-(pyrrolidine-1-carbonyl)phenylamino)cyclobut-3-ene-1,2-dione | CHEMBL399223
TypeSmall organic molecule
Emp. Form.C21H17BrClN3O4
Mol. Mass.490.734
SMILESOc1c(Nc2c(Nc3ccccc3Br)c(=O)c2=O)ccc(Cl)c1C(=O)N1CCCC1